{"text_format":"1","workbook":"xlsx","n_sheets":7,"sheets":["Profile Selection","ODVA ACDC Basic Profile","ODVA ACDC Extended Profile","ABB Drives Setup","Transparent 16 Profile","Transparent 32 Profile","Profile and Instances"],"not_rendered":{"charts":0,"images":10,"macros":1,"external_links":0,"defined_names":16,"comments":6,"pivot_tables":0},"unopened":[],"bounds":{"document_bytes":16777216,"sheet_cells":100000,"rows_first":2000,"rows_last":500,"rows_between":2000,"halvings":0,"cell_chars":16384,"cell_head_chars":4096},"cells_cut":0,"cells_raw":0,"read":"whole","date_system":"1900"}

{"sheet":"Profile Selection","index":0,"n_rows":400,"n_cols":56,"rows_kept":400,"cut":false,"hidden":false,"merged":[[18,1,18,5],[51,1,58,6],[20,1,29,1],[20,3,20,4],[21,3,21,4],[22,3,22,4],[25,3,25,4],[28,3,28,4],[44,1,44,10],[45,1,45,10],[43,1,43,13],[44,11,44,12],[46,1,46,10],[45,11,45,12],[46,11,46,12],[48,11,48,13],[41,1,41,4],[174,34,174,38],[59,2,60,5],[286,9,287,14],[10,1,10,19],[11,6,11,10],[18,16,18,18],[18,19,18,21],[29,9,29,10],[20,9,20,10],[28,9,28,10],[20,7,29,7],[24,3,24,4],[23,3,23,4],[27,3,27,4],[26,3,26,4],[175,48,175,49],[175,52,175,53],[174,48,174,54],[188,22,188,23],[188,28,188,29],[175,34,175,35],[175,37,175,38],[175,22,175,23],[175,25,175,26],[175,28,175,29],[174,22,174,27],[175,40,175,41],[175,31,175,32],[174,28,174,33],[174,40,174,46],[175,44,175,45],[22,9,22,10],[27,9,27,10],[26,9,26,10],[25,9,25,10],[21,9,21,10],[24,9,24,10],[23,9,23,10],[29,17,29,18],[30,17,30,18],[31,17,31,18],[32,17,32,18],[40,1,40,4],[29,3,29,4],[24,17,24,18],[25,17,25,18],[26,17,26,18],[27,17,27,18],[28,17,28,18],[19,17,19,18],[20,17,20,18],[21,17,21,18],[22,17,22,18],[23,17,23,18],[19,20,19,21],[20,20,20,21],[21,20,21,21],[22,20,22,21],[23,20,23,21],[29,20,29,21],[30,20,30,21],[31,20,31,21],[32,20,32,21],[24,20,24,21],[25,20,25,21],[26,20,26,21],[27,20,27,21],[28,20,28,21]]}
["Description of Excel Tool:  This spreadsheet tool is intended to assist users who are configuring an ABB ACS380, ACS480, ACS580, ACH580, ACQ580, ACS880, or DCS880 on Ethernet IP to communicate to a Rockwell PLC when replacing a Rockwell VFD with ABB VFD"]
[null,"The use of 1-Port modules or 2-Port Modules are identical in configuration, thus either can be used with this configuration tool."]
["Using this Tool:  "]
[null,"Follow the Steps below, filling out the Highlighted cells to help guide you through the selections of drive being used. "]
[null,"Then click on the tab which is defined in the \"Green\" Highlighted box to assist with defining the needed parameter configuration along with defining the corresponding Rockwell Logix 5000 software configuration."]
[null,"Note:  To assist the user of this tool, please reference the comments inserted in various cells for more information."]
["Follow the Steps below to Determine the correct Profile Configuration for your application:"]
[]
["Step 1","What ABB VFD are you configuring for Ethernet IP Communications?",null,null,null,null,null,null,"ACH580",null,"What Control Mode are you utilizing with the VFD?",null,null,null,null,"Vector"]
[]
[]
[null,null,null,null,null,null,null,null,null,null,null,null,{"$f":"IF(G12=\"Customized by the PLC Programmer - 32bit\", \"32 Bit\", \"16 Bit\")","v":"16 Bit"},"= Word Size"]
[]
["Step 3","A 2nd reference \"Torque Reference\" for VFD Control/Torque feeback is required.",null,null,null,null,null,null,null,"YES"]
[]
{"$rows_left_out":386}
{"sheet":"ODVA ACDC Basic Profile","index":1,"n_rows":76,"n_cols":20,"rows_kept":76,"cut":false,"hidden":true,"merged":[[24,9,24,19],[29,9,29,19],[2,0,2,3],[0,5,0,7],[9,0,9,3],[10,2,10,3],[10,0,10,1]]}
["Ethernet IP ODVA AC/DC Drive Basic Profile",null,null,null,null,"FENA-11/21 Configuration Parameters (Group 50 & 51)"]
[null,null,null,null,null,"Parameter Name","Parameter","Parameter Setting",null,"Rockwell Logix 5000 Software Configuration to add ABB VFDs as a new Ethernet IP Device"]
["VFD Signals Controlled by PLC over EIP",null,null,null,null,"FBA A enable",50.01,"Please Select..",null,"Note:  The configuration below is specific to the ODVA AC/DC Profile and the data "]
["Signal","No/Yes","Parameter","Parameter Setting",null,"FBA A comm loss func",50.02,"Fault",null,"supplied on the \"Profile Selection\" Tab of this Spreadsheet Tool.  This PLC configuration "]
["Run Command","YES",20.010000000000002,{"$f":"VLOOKUP($B$5,$B$69:$D$70,$C$66)","v":"Fieldbus A"},null,"FBA ref1 type",50.04,"Auto",null,"matches the parameters defined on this page and will deliver successful Communications"]
["Fault Reset","YES",{"$f":"IF('Profile Selection'!I9=\"DCS880\",20.13,31.11)","v":31.11},{"$f":"VLOOKUP($B$6,$B$71:$D$72,$C$66)","v":"\"No Setting Required\""},null,"FBA ref2 type",50.05,"Auto",null,"between the PLC and the ABB VFD via Ethernet IP"]
[{"$f":"IF('Profile Selection'!$P$9=\"Scalar (V/Hz)\",\"Frequency Reference\",\"Speed Reference\")","v":"Speed Reference"},"YES",{"$f":"IF('Profile Selection'!$P$9=\"Scalar (V/Hz)\",28.11,22.11)","v":22.11},{"$f":"VLOOKUP($B$7,$B$73:$D$74,$C$66)","v":"FB A ref1"},null,"FBA actual 1 type",50.07,{"$f":"IF($B$7=\"YES\", \"Auto\", \"Speed\")","v":"Auto"}]
["Torque Reference","NO",26.11,{"$f":"VLOOKUP($B$8,$B$75:$D$76,$C$66)","v":"\"User Defines Setting\""},null,"FBA actual 2 type",50.08,{"$f":"IF(AND($B$8=\"NO\", 'Profile Selection'!J14=\"YES\"),\"Torque\",\"Auto\")","v":"Torque"}]
[null,null,null,null,null,{"$f":"IF('Profile Selection'!$I$9=\"DCS880\",\"FBA A profile\",\" \")","v":" "},{"$f":"IF('Profile Selection'!$I$9=\"DCS880\",\"50.29\",\" \")","v":" "},{"$f":"IF('Profile Selection'!$I$9=\"DCS880\",\"DCP\",\" \")","v":" "}]
["Parameters for Configuring User Defined Data Words",null,null,null,null,"FBA A Type",51.01,"Ethernet"]
["Inputs (Read) to PLC from VFD",null,"Outputs (Write) from PLC to VFD",null,null,"Protocol / Profile",51.02,"100 (EIP AC/DC)"]
["Parameter","Parameter Setting","Parameter","Parameter Setting",null,"IP configuration",51.04,"0 (Static)"]
["52.01 (16bit)",{"$f":"IF($I$62=\"NA\",\"NA\", IF($J$62>169,'Profile Selection'!X190, \"NA\"))","v":"NA"},"53.01 (16bit)",{"$f":"IF($I$62=\"NA\",\"NA\", IF($I$62>119,'Profile Selection'!AD190, \"NA\"))","v":"NA"},null,"IP Address 1",51.05,{"$f":"'Profile Selection'!F41","v":192}]
["52.02 (16bit)",{"$f":"IF($I$62=\"NA\",\"NA\", IF($J$62>169,'Profile Selection'!X191, \"NA\"))","v":"NA"},"53.02 (16bit)",{"$f":"IF($I$62=\"NA\",\"NA\", IF($I$62>119,'Profile Selection'!AD191, \"NA\"))","v":"NA"},null,"IP Address 2",51.06,{"$f":"'Profile Selection'!G41","v":168}]
["52.03 (16bit)",{"$f":"IF($I$62=\"NA\",\"NA\", IF($J$62>169,'Profile Selection'!X192, \"NA\"))","v":"NA"},"53.03 (16bit)",{"$f":"IF($I$62=\"NA\",\"NA\", IF($I$62>119,'Profile Selection'!AD192, \"NA\"))","v":"NA"},null,"IP Address 3",51.07,{"$f":"'Profile Selection'!H41","v":3},null,null,null,null,null,null,null,null,null,{"$f":"J62","v":"NA"},null,{"$f":"K62","v":"NA"}]
{"$rows_left_out":62}
{"sheet":"ODVA ACDC Extended Profile","index":2,"n_rows":79,"n_cols":20,"rows_kept":79,"cut":false,"hidden":true,"merged":[[29,9,29,19],[24,9,24,19],[77,0,78,0],[74,0,75,0],[72,0,73,0],[70,0,71,0],[68,0,69,0],[29,5,29,8],[2,0,2,3],[0,5,0,7],[10,0,10,3],[11,2,11,3],[11,0,11,1]]}
["EIP ODVA AC/DC Drive Extended Profile",null,null,null,null,"FENA-11/21 Configuration Parameters (Group 50 & 51)"]
[null,null,null,null,null,"Parameter Name","Parameter","Parameter Setting",null,"Rockwell Logix 5000 Software Configuration to add ABB VFDs as a new Ethernet IP Device"]
["VFD Signals Controlled by PLC over EIP",null,null,null,null,"FBA A enable",50.01,"Please Select..",null,"Note:  The configuration below is specific to the ODVA AC/DC Extended Profile and the data "]
["Signal","No/Yes","Parameter","Parameter Setting",null,"FBA A comm loss func",50.02,"Fault",null,"supplied on the \"Profile Selection\" Tab of this Spreadsheet Tool.  This PLC configuration "]
["Run Command","YES",20.010000000000002,{"$f":"VLOOKUP($B$5,$B$69:$D$70,$C$66)","v":"Fieldbus A"},null,"FBA ref1 type",50.04,"Auto",null,"matches the parameters defined on this page and will deliver successful Communications"]
["Fault Reset","YES",{"$f":"IF('Profile Selection'!I9=\"DCS880\",20.13,31.11)","v":31.11},{"$f":"VLOOKUP($B$6,$B$71:$D$72,$C$66)","v":"\"No Setting Required\""},null,"FBA ref2 type",50.05,"Auto",null,"between the PLC and the ABB VFD via Ethernet IP"]
[{"$f":"IF('Profile Selection'!$P$9=\"Scalar (V/Hz)\",\"Frequency Reference\",\"Speed Reference\")","v":"Speed Reference"},"YES",{"$f":"IF('Profile Selection'!$P$9=\"Scalar (V/Hz)\",28.11,22.11)","v":22.11},{"$f":"VLOOKUP($B$7,$B$73:$D$74,$C$66)","v":"FB A ref1"},null,"FBA actual 1 type",50.07,{"$f":"IF($B$7=\"YES\", \"Auto\", \"Speed\")","v":"Auto"}]
["Direction Command","YES",{"$f":"'Profile Selection'!G85","v":20.21},{"$f":"VLOOKUP($B$8,$B$78:$C$79,2)","v":"Request"},null,"FBA actual 2 type",50.08,{"$f":"IF(AND($B$9=\"NO\", 'Profile Selection'!J14=\"YES\"),\"Torque\",\"Auto\")","v":"Torque"}]
["Torque Reference","NO",26.11,{"$f":"VLOOKUP($B$9,$B$75:$D$76,$C$66)","v":"\"User Defines Setting\""},null,{"$f":"IF('Profile Selection'!$I$9=\"DCS880\",\"FBA A profile\",\" \")","v":" "},{"$f":"IF('Profile Selection'!$I$9=\"DCS880\",\"50.29\",\" \")","v":" "},{"$f":"IF('Profile Selection'!$I$9=\"DCS880\",\"DCP\",\" \")","v":" "}]
[null,null,null,null,null,"FBA A Type",51.01,"Ethernet"]
["Parameters for Configuring User Defined Data Words",null,null,null,null,"Protocol / Profile",51.02,"100 (EIP AC/DC)"]
["Inputs (Read) to PLC from VFD",null,"Outputs (Write) from PLC to VFD",null,null,"IP configuration",51.04,"0 (Static)"]
["Parameter","Parameter Setting","Parameter","Parameter Setting",null,"IP Address 1",51.05,{"$f":"'Profile Selection'!F41","v":192}]
["52.01 (16bit)",{"$f":"IF($I$61=\"NA\",\"NA\", IF($J$61>169,'Profile Selection'!X190, \"NA\"))","v":"NA"},"53.01 (16bit)",{"$f":"IF($I$61=\"NA\",\"NA\", IF($I$61>119,'Profile Selection'!AD190, \"NA\"))","v":"NA"},null,"IP Address 2",51.06,{"$f":"'Profile Selection'!G41","v":168}]
["52.02 (16bit)",{"$f":"IF($I$61=\"NA\",\"NA\", IF($J$61>169,'Profile Selection'!X191, \"NA\"))","v":"NA"},"53.02 (16bit)",{"$f":"IF($I$61=\"NA\",\"NA\", IF($I$61>119,'Profile Selection'!AD191, \"NA\"))","v":"NA"},null,"IP Address 3",51.07,{"$f":"'Profile Selection'!H41","v":3},null,null,null,null,null,null,null,null,null,{"$f":"J61","v":"NA"},null,{"$f":"K61","v":"NA"}]
{"$rows_left_out":65}
{"sheet":"ABB Drives Setup","index":3,"n_rows":93,"n_cols":51,"rows_kept":93,"cut":false,"hidden":false,"merged":[[58,20,58,21],[49,23,49,24],[50,23,50,24],[51,23,51,24],[52,23,52,24],[53,23,53,24],[54,23,54,24],[55,23,55,24],[56,23,56,24],[57,23,57,24],[58,23,58,24],[53,20,53,21],[54,20,54,21],[55,20,55,21],[56,20,56,21],[57,20,57,21],[49,20,49,21],[50,20,50,21],[51,20,51,21],[52,20,52,21],[31,9,31,19],[57,0,58,0],[59,0,60,0],[26,5,26,8],[71,0,72,0],[65,0,66,0],[63,0,64,0],[61,0,62,0],[67,0,68,0],[69,0,70,0],[1,24,1,39],[3,24,3,40],[0,5,0,7],[2,0,2,3],[15,0,15,3],[7,35,24,36],[16,2,16,3],[16,0,16,1],[24,9,24,19],[25,35,25,36],[26,35,26,36],[27,35,27,36],[28,35,28,36],[29,35,29,36],[30,35,30,36],[31,35,31,36],[32,35,32,36],[33,35,33,36],[34,35,34,36],[32,50,32,51],[33,50,33,51],[34,50,34,51],[35,50,35,51],[7,50,25,51],[27,50,27,51],[28,50,28,51],[29,50,29,51],[30,50,30,51],[31,50,31,51],[26,50,26,51]]}
["Ethernet IP ABB Drives Profile",null,null,null,null,"FENA-11/21 Configuration Parameters (Group 50 & 51)"]
[null,null,null,null,null,"Parameter Name","Parameter","Parameter Setting",null,"Rockwell Logix 5000 Software Configuration to add ABB VFDs as a new Ethernet IP Device",null,null,null,null,null,null,null,null,null,null,null,null,null,null,"After the import of the Drive Emulation AOI be sure to label the proper data links on the new tags with the proper names associated with the data used.  "]
["VFD Signals Controlled by PLC over EIP",null,null,null,null,"FBA A enable",50.01,"Enable",null,"Note:  The configuration below is specific to the ABB Drives Profile and the data ",null,null,null,null,null,null,null,null,null,null,null,null,null,null,"The Control word and speed reference as well as status word and speed feedback is already premapped.  Any other data mapped will need to be labeled in the description field"]
["Signal","No/Yes","Parameter","Parameter Setting",null,"FBA A comm loss func",50.02,"Fault",null,"supplied on the \"Profile Selection\" Tab of this Spreadsheet Tool.  This PLC configuration ",null,null,null,null,null,null,null,null,null,null,null,null,null,null,"Copy and paste the description name from below into the description field of the tags generated from creating the AOI rung tags for the input and output data"]
["EXT1/EXT2 Select","NO",{"$f":"'ABB Drives Setup'!F83","v":19.11},{"$f":"VLOOKUP(B5,'ABB Drives Setup'!B66:C67,2,FALSE)","v":"EXT1"},null,"FBA ref1 type",50.04,"Auto",null,"matches the parameters defined on this page and will deliver successful Communications"]
["EXT1 Run Command","YES",{"$f":"'ABB Drives Setup'!B83","v":20.010000000000002},{"$f":"VLOOKUP(B6,'ABB Drives Setup'!B58:D59,'ABB Drives Setup'!C56)","v":"Fieldbus A"},null,"FBA ref2 type",50.05,"Auto",null,"between the PLC and the ABB VFD via Ethernet IP"]
["EXT2 Run Command","NO",{"$f":"'ABB Drives Setup'!J83","v":20.059999999999999},{"$f":"VLOOKUP(B7,'ABB Drives Setup'!B58:D59,'ABB Drives Setup'!C56)","v":"\"User Defines Setting\""},null,"FBA actual 1 type",50.07,{"$f":"IF($B$9=\"YES\", \"Auto\", \"Speed\")","v":"Auto"}]
["Direction Command","YES",{"$f":"'Profile Selection'!G85","v":20.21},{"$f":"VLOOKUP(B8,'ABB Drives Setup'!B64:C65,2)","v":"Request"},null,"FBA actual 2 type",50.08,{"$f":"IF(AND($B$12=\"NO\", 'Profile Selection'!J14=\"YES\"),\"Torque\",\"Auto\")","v":"Torque"}]
[{"$f":"IF('Profile Selection'!$P$9=\"Scalar (V/Hz)\",\"Frequency Reference 1\",\"Speed Reference 1\")","v":"Speed Reference 1"},"YES",{"$f":"'ABB Drives Setup'!D83","v":22.11},{"$f":"VLOOKUP(B9,'ABB Drives Setup'!B62:D63,'ABB Drives Setup'!C56)","v":"FB A ref1"},null,{"$f":"IF('Profile Selection'!$I$9=\"DCS880\",\"FBA A profile\",\" \")","v":" "},{"$f":"IF('Profile Selection'!$I$9=\"DCS880\",\"50.29\",\" \")","v":" "},{"$f":"IF('Profile Selection'!$I$9=\"DCS880\",\"DCP\",\" \")","v":" "}]
[{"$f":"IF('Profile Selection'!$P$9=\"Scalar (V/Hz)\",\"Frequency Reference 2\",\"Speed Reference 2\")","v":"Speed Reference 2"},"NO",{"$f":"'ABB Drives Setup'!G83","v":22.18},{"$f":"VLOOKUP(B10,'ABB Drives Setup'!B68:D69,'ABB Drives Setup'!C56)","v":"\"User Defines Setting\""},null,"FBA A Type",51.01,"Ethernet"]
[{"$f":"IF('Profile Selection'!$P$9=\"Scalar (V/Hz)\",\"Freq Ref 1/2 Sel\",\"Speed Ref 1/2 Sel\")","v":"Speed Ref 1/2 Sel"},"NO",{"$f":"'ABB Drives Setup'!H83","v":"See 19.11"},{"$f":"VLOOKUP('Profile Selection'!I9,'ABB Drives Setup'!A86:D92,'ABB Drives Setup'!C93,FALSE)","v":"\"See Ext1/Ext2 Sel\""},null,"Protocol / Profile",51.02,"101 (EIP ABB Pro)"]
["Torque Reference 1","NO",{"$f":"'ABB Drives Setup'!I83","v":26.11},{"$f":"VLOOKUP(B12,'ABB Drives Setup'!B70:D71,'ABB Drives Setup'!C56)","v":"\"User Defines Setting\""},null,"IP configuration",51.04,"0 (Static)"]
["Fault Reset","YES",{"$f":"'ABB Drives Setup'!C83","v":31.11},{"$f":"VLOOKUP(B13,'ABB Drives Setup'!B60:D61,'ABB Drives Setup'!C56)","v":"FBA A MCW bit 7"},null,"IP Address 1",51.05,{"$f":"'Profile Selection'!F41","v":192}]
[null,null,null,null,null,"IP Address 2",51.06,{"$f":"'Profile Selection'!G41","v":168}]
[null,null,null,null,null,"IP Address 3",51.07,{"$f":"'Profile Selection'!H41","v":3},null,null,null,null,null,null,null,null,null,152,null,13]
{"$rows_left_out":79}
{"sheet":"Transparent 16 Profile","index":4,"n_rows":93,"n_cols":20,"rows_kept":93,"cut":false,"hidden":true,"merged":[[24,0,24,1],[25,0,25,1],[0,5,0,7],[2,0,2,3],[14,0,14,3],[15,0,15,1],[16,0,16,1],[17,0,17,1],[18,0,18,1],[19,0,19,1],[20,0,20,1],[21,0,21,1],[22,0,22,1],[23,0,23,1],[33,0,33,3],[34,2,34,3],[34,0,34,1],[31,0,31,1],[30,5,30,8],[26,0,26,1],[27,0,27,1],[28,0,28,1],[29,0,29,1],[30,0,30,1]]}
["Ethernet IP Transparent 16 (Bit) Profile",null,null,null,null,"FENA-11/21 Configuration Parameters (Group 50 & 51)"]
[null,null,null,null,null,"Parameter Name","Parameter","Parameter Setting",null,"Rockwell Logix 5000 Software Configuration to add ABB VFDs as a new Ethernet IP Device"]
["VFD Signals Controlled by PLC over EIP",null,null,null,null,"FBA A enable",50.01,"Please Select..",null,"Note:  The configuration below is specific to the Transparent 16 Profile and the data "]
["Signal","No/Yes","Parameter","Parameter Setting",null,"FBA A comm loss func",50.02,"Fault Always",null,"supplied on the \"Profile Selection\" Tab of this Spreadsheet Tool.  This PLC configuration "]
["EXT1/EXT2 Select","NO",{"$f":"'ABB Drives Setup'!F83","v":19.11},{"$f":"VLOOKUP(B5,'ABB Drives Setup'!B66:C67,2,FALSE)","v":"EXT1"},null,"FBA ref1 type",50.04,"Auto",null,"matches the parameters defined on this page and will deliver successful Communications"]
["EXT1 Run Command","YES",{"$f":"'ABB Drives Setup'!B83","v":20.010000000000002},{"$f":"VLOOKUP(B6,'ABB Drives Setup'!B58:D59,'ABB Drives Setup'!C56)","v":"Fieldbus A"},null,"FBA ref2 type",50.05,"Auto",null,"between the PLC and the ABB VFD via Ethernet IP"]
["EXT2 Run Command","NO",{"$f":"'ABB Drives Setup'!J83","v":20.059999999999999},{"$f":"VLOOKUP(B7,'ABB Drives Setup'!B58:D59,'ABB Drives Setup'!C56)","v":"\"User Defines Setting\""},null,"FBA actual 1 type",50.07,{"$f":"IF($B$9=\"YES\", \"Auto\", \"Speed\")","v":"Auto"}]
["Direction Command","YES",{"$f":"'Profile Selection'!G85","v":20.21},{"$f":"VLOOKUP(B8,'ABB Drives Setup'!B64:C65,2)","v":"Request"},null,"FBA actual 2 type",50.08,{"$f":"IF(AND($B$12=\"NO\", 'Profile Selection'!J14=\"YES\"),\"Torque\",\"Auto\")","v":"Torque"}]
[{"$f":"IF('Profile Selection'!$P$9=\"Scalar (V/Hz)\",\"Frequency Reference 1\",\"Speed Reference 1\")","v":"Speed Reference 1"},"YES",{"$f":"'ABB Drives Setup'!D83","v":22.11},{"$f":"VLOOKUP(B9,'ABB Drives Setup'!B62:D63,'ABB Drives Setup'!C56)","v":"FB A ref1"},null,"FBA A SW transparent source",50.09,"User Status Word 1"]
[{"$f":"IF('Profile Selection'!$P$9=\"Scalar (V/Hz)\",\"Frequency Reference 2\",\"Speed Reference 2\")","v":"Speed Reference 2"},"NO",{"$f":"'ABB Drives Setup'!G83","v":22.18},{"$f":"VLOOKUP(B10,'ABB Drives Setup'!B68:D69,'ABB Drives Setup'!C56)","v":"\"User Defines Setting\""},null,"FBA A act1 transparent source",50.1,"Not selected"]
[{"$f":"IF('Profile Selection'!$P$9=\"Scalar (V/Hz)\",\"Freq Ref 1/2 Sel\",\"Speed Ref 1/2 Sel\")","v":"Speed Ref 1/2 Sel"},"NO",{"$f":"'ABB Drives Setup'!H83","v":"See 19.11"},{"$f":"VLOOKUP('Profile Selection'!I9,'ABB Drives Setup'!A86:D92,C93,FALSE)","v":"\"See Ext1/Ext2 Sel\""},null,"FBA A act2 transparent source",50.11,"Not selected"]
["Torque Reference 1","NO",{"$f":"'ABB Drives Setup'!I83","v":26.11},{"$f":"VLOOKUP(B12,'ABB Drives Setup'!B70:D71,'ABB Drives Setup'!C56)","v":"\"User Defines Setting\""},null,{"$f":"IF('Profile Selection'!$I$9=\"DCS880\",\"FBA A profile\",\" \")","v":" "},{"$f":"IF('Profile Selection'!$I$9=\"DCS880\",\"50.29\",\" \")","v":" "},{"$f":"IF('Profile Selection'!$I$9=\"DCS880\",\"DCP\",\" \")","v":" "}]
["Fault Reset","YES",{"$f":"'ABB Drives Setup'!C83","v":31.11},{"$f":"VLOOKUP(B13,'ABB Drives Setup'!B60:D61,'ABB Drives Setup'!C56)","v":"FBA A MCW bit 7"},null,"FBA A Type",51.01,"Ethernet"]
[null,null,null,null,null,"Protocol / Profile",51.02,"102 (EIP T16)"]
["Parameters for Configuring User Defined Status Word",null,null,null,null,"IP configuration",51.04,"0 (Static)",null,null,null,null,null,null,null,null,null,{"$f":"J60","v":"NA"},null,{"$f":"K60","v":"NA"}]
{"$rows_left_out":79}
{"sheet":"Transparent 32 Profile","index":5,"n_rows":93,"n_cols":20,"rows_kept":93,"cut":false,"hidden":true,"merged":[[17,0,17,1],[0,5,0,7],[2,0,2,3],[14,0,14,3],[15,0,15,1],[16,0,16,1],[23,0,23,1],[18,0,18,1],[19,0,19,1],[20,0,20,1],[21,0,21,1],[22,0,22,1],[24,0,24,1],[25,0,25,1],[26,0,26,1],[27,0,27,1],[28,0,28,1],[30,5,30,8],[33,0,33,3],[34,2,34,3],[34,0,34,1],[29,0,29,1],[30,0,30,1],[31,0,31,1]]}
["Ethernet IP Transparent 32 (Bit) Profile",null,null,null,null,"FENA-11/21 Configuration Parameters (Group 50 & 51)"]
[null,null,null,null,null,"Parameter Name","Parameter","Parameter Setting",null,"Rockwell Logix 5000 Software Configuration to add ABB VFDs as a new Ethernet IP Device"]
["VFD Signals Controlled by PLC over EIP",null,null,null,null,"FBA A enable",50.01,"Please Select..",null,"Note:  The configuration below is specific to the Transparent 32 Profile and the data "]
["Signal","No/Yes","Parameter","Parameter Setting",null,"FBA A comm loss func",50.02,"Fault Always",null,"supplied on the \"Profile Selection\" Tab of this Spreadsheet Tool.  This PLC configuration "]
["EXT1/EXT2 Select","NO",{"$f":"'ABB Drives Setup'!F83","v":19.11},{"$f":"VLOOKUP(B5,'ABB Drives Setup'!B66:C67,2,FALSE)","v":"EXT1"},null,"FBA ref1 type",50.04,"Auto",null,"matches the parameters defined on this page and will deliver successful Communications"]
["EXT1 Run Command","YES",{"$f":"'ABB Drives Setup'!B83","v":20.010000000000002},{"$f":"VLOOKUP(B6,'ABB Drives Setup'!B58:D59,'ABB Drives Setup'!C56)","v":"Fieldbus A"},null,"FBA ref2 type",50.05,"Auto",null,"between the PLC and the ABB VFD via Ethernet IP"]
["EXT2 Run Command","NO",{"$f":"'ABB Drives Setup'!J83","v":20.059999999999999},{"$f":"VLOOKUP(B7,'ABB Drives Setup'!B58:D59,'ABB Drives Setup'!C56)","v":"\"User Defines Setting\""},null,"FBA actual 1 type",50.07,{"$f":"IF($B$9=\"YES\", \"Auto\", \"Speed\")","v":"Auto"}]
["Direction Command","YES",{"$f":"'Profile Selection'!G85","v":20.21},{"$f":"VLOOKUP(B8,'ABB Drives Setup'!B64:C65,2)","v":"Request"},null,"FBA actual 2 type",50.08,{"$f":"IF(AND($B$12=\"NO\", 'Profile Selection'!J14=\"YES\"),\"Torque\",\"Auto\")","v":"Torque"}]
[{"$f":"IF('Profile Selection'!$P$9=\"Scalar (V/Hz)\",\"Frequency Reference 1\",\"Speed Reference 1\")","v":"Speed Reference 1"},"YES",{"$f":"'ABB Drives Setup'!D83","v":22.11},{"$f":"VLOOKUP(B9,'ABB Drives Setup'!B62:D63,'ABB Drives Setup'!C56)","v":"FB A ref1"},null,"FBA A SW transparent source",50.09,"User Status Word 1"]
[{"$f":"IF('Profile Selection'!$P$9=\"Scalar (V/Hz)\",\"Frequency Reference 2\",\"Speed Reference 2\")","v":"Speed Reference 2"},"NO",{"$f":"'ABB Drives Setup'!G83","v":22.18},{"$f":"VLOOKUP(B10,'ABB Drives Setup'!B68:D69,'ABB Drives Setup'!C56)","v":"\"User Defines Setting\""},null,"FBA A act1 transparent source",50.1,"Not selected"]
[{"$f":"IF('Profile Selection'!$P$9=\"Scalar (V/Hz)\",\"Freq Ref 1/2 Sel\",\"Speed Ref 1/2 Sel\")","v":"Speed Ref 1/2 Sel"},"NO",{"$f":"'ABB Drives Setup'!H83","v":"See 19.11"},{"$f":"VLOOKUP('Profile Selection'!I9,'ABB Drives Setup'!A86:D92,C93,FALSE)","v":"\"See Ext1/Ext2 Sel\""},null,"FBA A act2 transparent source",50.11,"Not selected"]
["Torque Reference 1","NO",{"$f":"'ABB Drives Setup'!I83","v":26.11},{"$f":"VLOOKUP(B12,'ABB Drives Setup'!B70:D71,'ABB Drives Setup'!C56)","v":"\"User Defines Setting\""},null,{"$f":"IF('Profile Selection'!$I$9=\"DCS880\",\"FBA A profile\",\" \")","v":" "},{"$f":"IF('Profile Selection'!$I$9=\"DCS880\",\"50.29\",\" \")","v":" "},{"$f":"IF('Profile Selection'!$I$9=\"DCS880\",\"DCP\",\" \")","v":" "}]
["Fault Reset","YES",{"$f":"'ABB Drives Setup'!C83","v":31.11},{"$f":"VLOOKUP(B13,'ABB Drives Setup'!B60:D61,'ABB Drives Setup'!C56)","v":"FBA A MCW bit 7"},null,"FBA A Type",51.01,"Ethernet"]
[null,null,null,null,null,"Protocol / Profile",51.02,"103 (EIP T32)"]
["Parameters for Configuring User Defined Status Word",null,null,null,null,"IP configuration",51.04,"0 (Static)",null,null,null,null,null,null,null,null,null,{"$f":"J60","v":"NA"},null,{"$f":"L60","v":"NA"}]
{"$rows_left_out":79}
{"sheet":"Profile and Instances","index":6,"n_rows":40,"n_cols":1,"rows_kept":40,"cut":false,"hidden":true,"merged":[[33,0,33,18],[36,0,36,18],[39,0,39,18]]}
[]
[]
[]
[]
[]
[]
[]
[]
[]
[]
[]
[]
[]
[]
[]
{"$rows_left_out":25}